{"text_format":"1","workbook":"xlsx","n_sheets":10,"sheets":["Instructions","Cover_Sheet","Filter","MRI","Procedures","Cover Letter","NODAdmin Table","NOD1 Table","NOD2 Table","SourceData"],"not_rendered":{"charts":0,"images":24,"macros":1,"external_links":1,"defined_names":62,"comments":0,"pivot_tables":0},"unopened":[],"bounds":{"document_bytes":16777216,"sheet_cells":100000,"rows_first":2000,"rows_last":500,"rows_between":2000,"halvings":0,"cell_chars":16384,"cell_head_chars":4096},"cells_cut":0,"cells_raw":0,"read":"whole","date_system":"1900"}

{"sheet":"Instructions","index":0,"n_rows":63,"n_cols":2,"rows_kept":63,"cut":false,"hidden":false,"merged":[]}
["For use with a screen reader, Press UP or DOWN ARROW to read through the document."]
["This checklist is an Excel workbook that will create a customized checklist based on the facility type. The workbook consists of several worksheets that can be selected using the tabs at the bottom of the Excel window. You must enable active content to use this file. After you have done so, click the button at the end to open the checklist worksheets. "]
["Cover Sheet Tab, Begin the application by filling out basic facility information on this tab. Once you have filled out the fields, proceed to the Filter Tab. "]
["Filter Sheet Tab, Click the buttons that correspond to your project type. Once you have clicked the button you will be redirected to the Master Rule Index (MRI) tab and the MRI will have been filtered for the type of project you selected. A different checklist may be selected by resetting the MRI tab and reselecting a project type on the filter tab. Any information already entered into the checklist will not be lost by using the reset button. "]
["MRI Sheet Tab, This worksheet contains the list of items that must be addressed to ensure a complete application is submitted. The checklist contains two columns for applicant or consultant use. These are the location and comments columns. This information will be used by TCEQ in the review process. "]
["Providing a page number or other location information will automatically change the \"Complete?\" column from \"no\" to \"yes\". Rows with grey-filled cells are for informational purposes and are now required to be answered. Additional filters are available under the Application Part (\"App Part\") and Application Area columns for you to view/select specific application topic or areas. "]
["Disclaimer: This checklist is intended for use as a reference in the application process and will not be considered a substitute for required application materials. Rules referenced have been paraphrased or reworded to facilitate this process.  Any conflict or questions regarding rule interpretation should be directed to TCEQ for determination, and disputes will be resolved in favor of the exact language of rules, statutes or federal requirements.  Should any dispute occur in an administrative proceeding, the applicant will bear the burden of proof of compliance with any and all applicable TCEQ and federal statutes, rules, or policies and procedures.  This checklist is subject to discovery in administrative and civil legal proceedings and should not be considered confidential from the public."]
["Press Alt+M to open remaining tabs, after enabling active content."]
["Enabling Active Content, If you are unable to enable macros to continue please visit Microsoft's support webpage at https://support.office.com/en-us/article/enable-or-disable-macros-in-office-files-12b036fd-d140-4e74-b45e-16fed1a7e5c6, for additional instructions. Contact your network administrator if you are still unable to enable macros. \n"]
["Contact Us, For questions and information, please contact the MSW Permits Section at mswper@tceq.texas.gov or (512)239-2335, or visit http://www.tceq.texas.gov/permitting/waste_permits.\n"]
["End of Worksheet"]
[]
[]
[]
[]
[]
[]
[]
[]
[]
[]
[]
[]
[]
[]
[]
[]
[]
[]
[]
{"$rows_left_out":34}
{"sheet":"Cover_Sheet","index":1,"n_rows":30,"n_cols":9,"rows_kept":30,"cut":false,"hidden":false,"merged":[[26,2,26,3]]}
["This checklist is designed to provide guidance for the Municipal Solid Waste (MSW) rules found in Title 30 Texas Administrative Code (30 TAC) Chapter 330, for Type I, IV and V registration, permit, and permit amendment applications. Areas of the checklist that are shaded in gray are for information purposes only.  Please fill out application information before selecting and filling out a checklist.\n"]
[null,"Administrative and Technical Review Checklist for Municipal Solid "]
[null,"Waste (MSW) Permits, Registrations and Amendments"]
[]
[]
[null,null,null,"Applicant Information"]
[]
[null,"Company:","NIDO, Ltd."]
[null,"First name:","Ben",null,null,"Last name","Davis"]
[null,"Applicant Title:","Owner",null,null,null,null,"Prefix:"]
[null,"Street Address:","550 Farm-To-Market Road 78"]
[null,"City:","Schertz",null,"State:","TX",null,"Zip code:",78154]
[null,"Applicant E-Mail:","bdavis@beckcompanies.com"]
[]
[null,null,null,"Consultant Information"]
[]
[null,"First name:","Adam",null,null,"Last name:","Mehevec"]
[null,"Consultant Title:","Principal",null,null,null,null,"Prefix:"]
[null,"Consultant Firm:","Civil & Environmental Consultants, Inc."]
[null,"Consultant Address:","3711 S. MOPAC, Bldg. 1, Suite 550"]
[null,"City:","Austin",null,"State:","TX",null,"Zip code:",78746]
[null,"Consultant E-Mail:","amehevec@cecinc.com"]
[]
[null,null,null,"Application Information"]
[]
[null,"Facility Name:","Beck Landfill"]
[null,"Application Date"]
[null,"CN:","CN603075011",null,null,null,"MSW ID:",1848]
[null,"RN:","RN102310968",null,null,"Authorization Type:","Permit"]
[null,"County:","Guadalupe",null,null,"Application Type:","Permit Amendment"]
{"$rows_left_out":1}
{"sheet":"Filter","index":2,"n_rows":62,"n_cols":8,"rows_kept":62,"cut":false,"hidden":false,"merged":[]}
["For use with a screen reader, Press UP or DOWN ARROW for filter hotkeys."]
["For Type 1 landfill checklist, Press ALT+q"]
["For Type 1 Arid-Exempt landfill checklist, Press ALT+e",null,null,null,null,"Create a Checklist"]
["For Type 4 landfill checklist, Press ALT+w"]
["For Type 4 Arid-Exempt landfill checklist, Press ALT+r"]
["For Type I & 4 Arid-Exempt Landfill checklist, Press ALT+t"]
["For Type 5 Transfer Station Permit Checklist, Press ALT+y",null,null,"Landfill Checklists",null,null,null,"Click to reset MRI Tab"]
["For Type 5 Liquid Waste Processing Permit Checklist, Press ALT+u"]
["For Type 5 Liquid Waste Transfer Permit Checklist, Press ALT+i"]
["For Type 5 Recycling and Recovery Permit Checklist, Press ALT+o"]
["For Type 5 Transfer Station Registration Checklist, Press ALT+p"]
["For Type 5 Liquid Waste Transfer Registration Checklist, Press ALT+s"]
["For Type 5 Liquid Waste Processing Registration Checklist, Press ALT+a",null,null,null,null,null,null,"Other Checklists"]
["For Type 5 Recycling and Recovery Registration Checklist, Press ALT+d"]
["For Type 6 Demonstration Checklist, Press ALT+f"]
["For Type 9 Landfill Mining Applications Checklist, Press ALT+g"]
["To Reset the Checklist, Press ALT+h"]
["End of Worksheet."]
[]
[null,null,null,"Type V Permit Checklists",null,null,null,"Type V Registration Checklists"]
[]
[]
[]
[]
[]
[]
[]
[]
[]
[]
{"$rows_left_out":33}
{"sheet":"MRI","index":3,"n_rows":1167,"n_cols":36,"rows_kept":1167,"cut":false,"hidden":false,"merged":[]}
["ID","App. Part","Checklist Item","Item Type","Citation","Complete?","Location","Applicant Comments","Application Area","T/NT","Admin NOD Type","1st NOD Type","2nd NOD Type","PM Comments","NOD Description","PM Initials","Type I","Type IV","Type IAE","Type IV AE","Type V GG (Permit)","Type V TS (Permit)","Type V Recycling (Permit)","Type V TL (Permit)","Type V GG (Reg.)","Type V TS (Reg.)","Type V Recycling (Reg.)","Type V TL (Reg.)","Incinerator","Mobile Liquid Waste ","Landfill Mining","Type VI Demonstration Facilities","Type IAE & IVAE Landfill","Admin Review","Admin Complete?","Type V GG (Reg.) at WWTP"]
[1,"General","Submit all four parts of the permit, permit amendment or registration application","Required ","330.57(a) & (b)",{"$f":"IF(G2<>\"\",\"Yes\",\"No\")","v":"Yes"},"See Application Parts I through IV",null,"Format-Application",null,null,null,null,null,null,null,"x","x","x","x","x","x","x","x","x","x","x","x","x","x","x","x",{"$f":"IF(OR(S2=\"x\",T2=\"x\"),\"x\",\"\")","v":"x"},"x",null,"x"]
[2,"General","Submit TCEQ Part I Form (Form No. 0650)  ","Required ","330.57(c)(1)",{"$f":"IF(G3<>\"\",\"Yes\",\"No\")","v":"Yes"},"Part I","Updated October 3, 2022 to identify permit as 1848A","Forms",null,null,null,null,null,null,null,"x","x","x","x","x","x","x","x","x","x","x","x","x","x","x","x","x","x",null,"x"]
[3,"General","Submit TCEQ Transportation Data and Report (Form No. 20719)","Required","305.45(a)","No",null,null,"Forms",null,null,null,null,null,null,null,"x",null,null,null,null,null,null,null,null,null,null,null,null,null,null,null,null,"x"]
[4,"General","Submit TCEQ Closure Plan\n(Form No. 20720","Required","305.45(a)","No",null,null,"Forms",null,null,null,null,null,null,null,"x",null,null,null,null,null,null,null,null,null,null,null,null,null,null,null,null,"x"]
[5,"General","Submit TCEQ Closure Cost Estimate\n(Form No. 20721","Required","305.45(a)","No",null,null,"Forms",null,null,null,null,null,null,null,"x",null,null,null,null,null,null,null,null,null,null,null,null,null,null,null,null,"x"]
[6,"General","Submit TCEQ Post Closure Care Plan\n(Form No. 20722)","Required","305.45(a)","No",null,null,"Forms",null,null,null,null,null,null,null,"x",null,null,null,null,null,null,null,null,null,null,null,null,null,null,null,null,"x"]
[7,"General","Submit TCEQ Post Closure Cost Estimate (Form No. 20723)","Required","305.45(a)","No",null,null,"Forms",null,null,null,null,null,null,null,"x",null,null,null,null,null,null,null,null,null,null,null,null,null,null,null,null,"x"]
[8,"General","Part II of the application contains location and coordination information.","Informational","330.57(c)(2)",null,"Acknowledged",null,"Format-Application",null,null,null,null,null,null,null,"x","x","x","x","x","x","x","x","x","x","x","x","x","x","x","x",{"$f":"IF(OR(S9=\"x\",T9=\"x\"),\"x\",\"\")","v":"x"},null,null,"x"]
[9,"General","Part III of the application contains design information","Informational","330.57(c)(3)",null,"Acknowledged",null,"Format-Application",null,null,null,null,null,null,null,"x","x","x","x","x","x","x","x","x","x","x","x","x","x","x","x","x",null,null,"x"]
[10,"General","Part IV of the application contains the site operating plan","Informational","330.57(c)(4)",null,"Acknowledged",null,"Format-Application",null,null,null,null,null,null,null,"x","x","x","x","x","x","x","x","x","x","x","x","x","x","x","x","x",null,null,"x"]
[11,"General","The application should address all aspects of application and design requirements, even to show why not applicable (N/A)","Informational","330.57(d)",null,"Acknowledged",null,"Format-Application",null,null,null,null,null,null,null,"x","x","x","x","x","x","x","x","x","x","x","x","x","x","x","x","x","x",null,"x"]
[12,"General","Submit data of sufficient completeness, accuracy and clarity","Required ","330.57(d)",{"$f":"IF(G13<>\"\",\"Yes\",\"No\")","v":"Yes"},"See Application Parts I through IV",null,"Format-Application",null,null,null,null,null,null,null,"x","x","x","x","x","x","x","x","x","x","x","x","x","x","x","x","x","x",null,"x"]
[13,"General","Failure to provide complete information may be cause for ED to return application.","Informational","330.57(d) ",null,"Acknowledged",null,"Format-Application",null,null,null,null,null,null,null,"x","x","x","x","x","x","x","x","x","x","x","x","x","x","x","x","x","x",null,"x"]
[14,"General","Provide 4 Copies for Initial Submittal (1 original and 3 copies)","Required ","330.57(e)",{"$f":"IF(G15<>\"\",\"Yes\",\"No\")","v":"Yes"},"Three copies submitted to MSW permits and one was sent to the Region Office",null,"Format-Application",null,null,null,null,null,null,null,"x","x","x","x","x","x","x","x","x","x","x","x","x","x","x","x","x","x",null,"x"]
[15,"General","Provide 4 copies for NOD Responses including 1 copy with marked revisions (redline/strikeout)","Required ","330.57(g)(6)",{"$f":"IF(G16<>\"\",\"Yes\",\"No\")","v":"Yes"},"Three copies submitted to MSW permits and one was sent to the Region Office",null,"Format-Application",null,null,null,null,null,null,null,"x","x","x","x","x","x","x","x","x","x","x","x","x","x","x","x","x",null,null,"x"]
[16,"General","Application must be prepared in accordance with  Texas Occupations Code, Texas Engineering Practice Act, Chapter 1001 and Texas Geoscience Practice Act, Chapter 1002","Informational","330.57(f)",null,"Acknowledged",null,"Format-Application",null,null,null,null,null,null,null,"x","x","x","x","x","x","x","x","x","x","x","x","x","x","x","x","x","x",null,"x"]
[17,"General","Provide a PE signature, seal and date on the title page of each bound engineering report or individual engineering plan, and on each engineering drawing ","Required ","330.57(f)(1)",{"$f":"IF(G18<>\"\",\"Yes\",\"No\")","v":"Yes"},"See Application Parts I through IV",null,"Format-Application",null,null,null,null,null,null,null,"x","x","x","x","x","x","x","x","x","x","x","x","x","x","x","x","x",null,null,"x"]
[18,"General","Provide PG sign, seal, & date for applicable items","Required ","330.57(f)(2)","Yes","See Application Parts I through IV",null,"Format-Application",null,null,null,null,null,null,null,"x","x","x","x","x","x","x","x","x","x","x","x",null,null,"x","x","x",null,null,"x"]
[19,"General","Applications that are not sealed are incomplete and shall be returned","Informational ","330.57(f)(3)",null,"Acknowledged",null,"Format-Application",null,null,null,null,null,null,null,"x","x","x","x","x","x","x","x","x","x","x","x","x","x","x","x","x","x",null,"x"]
[20,"General","Submit the application in three ring-binders","Required ","330.57(g)(1)","Yes","Complete",null,"Format-Application",null,null,null,null,null,null,null,"x","x","x","x","x","x","x","x","x","x","x","x","x","x","x","x","x","x",null,"x"]
[21,"General","Submit Title Page with Name, Application No., Site Operator Name, Operator Name (if applicable),  Location, Date Prepared and Revision Date(s)","Required ","330.57(g)(2)","Yes","See Application Parts I through IV",null,"Format-Application",null,null,null,null,null,null,null,"x","x","x","x","x","x","x","x","x","x","x","x","x","x","x","x","x","x",null,"x"]
[22,"General","Provide Table of Contents with PE seal","Required ","330.57(g)(3)","Yes","See Application Table of Contents",null,"Format-Application",null,null,null,null,null,null,null,"x","x","x","x","x","x","x","x","x","x","x","x","x","x","x","x","x","x",null,"x"]
[23,"General","Use 8.5x11 inch or 11x17 paper (folded to 8.5x11 inch)","Required ","330.57(g)(4)","Yes","See Application Parts I through IV",null,"Format-Application",null,null,null,null,null,null,null,"x","x","x","x","x","x","x","x","x","x","x","x","x","x","x","x","x","x",null,"x"]
[24,"General","Provide pages with date (original and revised) and sequential page numbers","Required ","330.57(g)(5)","Yes","See Application Parts I through IV",null,"Format-Application",null,null,null,null,null,null,null,"x","x","x","x","x","x","x","x","x","x","x","x","x","x","x","x","x","x",null,"x"]
[25,"General","Provide legible drawings/maps ","Required ","330.57(h)(1)","Yes","See Application Parts I through IV",null,"Format-Maps/Drawings",null,null,null,null,null,null,null,"x","x","x","x","x","x","x","x","x","x","x","x","x","x","x","x","x","x",null,"x"]
[26,"General","Provide color coding on all figures and drawings that is legible and distinct after copying in black & white","Required ","330.57(h)(2)","Yes","See Application Parts I through IV",null,"Format-Maps/Drawings",null,null,null,null,null,null,null,"x","x","x","x","x","x","x","x","x","x","x","x","x","x","x","x","x","x",null,"x"]
[27,"General","Provide a standard engineering scale on each figure or drawing","Required ","330.57(h)(3)","Yes","See Application Parts I through IV",null,"Format-Maps/Drawings",null,null,null,null,null,null,null,"x","x","x","x","x","x","x","x","x","x","x","x","x","x","x","x","x","x",null,"x"]
[28,"General","Provide a dated title block on each figure or drawing","Required ","330.57(h)(4)(A)","Yes","See Application Parts I through IV",null,"Format-Maps/Drawings",null,null,null,null,null,null,null,"x","x","x","x","x","x","x","x","x","x","x","x","x","x","x","x","x","x",null,"x"]
[29,"General","Provide a bar scale at least 1 inch on all figures and drawings","Required ","330.57(h)(4)(B)","Yes","See Application Parts I through IV",null,"Format-Maps/Drawings",null,null,null,null,null,null,null,"x","x","x","x","x","x","x","x","x","x","x","x","x","x","x","x","x","x",null,"x"]
{"$rows_left_out":1138}
{"sheet":"Procedures","index":4,"n_rows":43,"n_cols":6,"rows_kept":43,"cut":false,"hidden":true,"merged":[[42,0,43,10],[39,0,41,8],[33,0,35,10],[30,2,30,3],[28,6,28,8],[29,2,29,3],[31,2,31,3],[27,6,27,8],[28,2,28,3],[5,0,6,10],[8,0,8,10],[10,0,12,10],[14,0,16,10],[27,2,27,3],[24,0,25,10],[26,6,26,7],[26,2,26,3]]}
["Make sure the MRI is correctly filtered for the project."]
[{"$f":"\"The MRI is filtered for: \"&SourceData!E25","v":"The MRI is filtered for: Type IV Landfill"}]
[]
["Drafting NODs"]
["Specific information must be entered on the MRI tab below and shown in the image to draft an NOD."]
["Applications submitted using the checklist should have location information and comments for individual items that may need additional clarification. (i.e. why a particular rule cite is not applicable)"]
[]
[]
["The Project Manager will input NOD types, Technical/Non-Technical identifiers and NOD descriptions in the corresponding columns. "]
[]
["There is only one NOD description column on the MRI. Therefore, the NOD description on the MRI tab must be revised and/or overwritten entirely for NODs that follow a previous NOD that used the previous citation. The NOD decription for sent NODs are available in our signed letter and on the 'NOD(#) Table' tabs. "]
[]
[]
[]
["Location information may be filled in by project managers if the information that satisfies the rule citation is found. In addition to the NOD functions, the MRI contains a \"PM Comments\" column for project managers to record notes about specific information during their review."]
[]
[]
[]
["Generate the NOD Table"]
[]
[]
[]
[]
["Generate and Print Letter for Review"]
["Project managers should review the information on the \"Cover_Sheet\" tab and fill out TCEQ information below before printing a letter for review."]
[]
[null,"Region:",null,null,null,"Tracking No.: "]
[null,"NOD Number:",null,null,null,"PM Title:"]
[null,"NOD response date:",null,null,null,"PM Name:"]
[null,"PM ext:"]
{"$rows_left_out":14}
{"sheet":"Cover Letter","index":5,"n_rows":78,"n_cols":4,"rows_kept":78,"cut":false,"hidden":true,"merged":[[5,1,5,10],[29,1,29,10],[6,1,6,10],[8,1,8,10],[23,1,27,10],[28,1,28,10],[30,1,30,10],[31,1,31,10],[63,3,63,10],[34,2,34,10],[59,1,59,10],[60,1,60,10],[61,1,61,10],[62,1,62,10],[33,2,33,10],[32,1,32,10],[42,1,47,10],[36,1,41,10],[74,1,74,5],[75,1,75,5],[76,1,76,5],[77,1,77,5],[68,1,68,4],[70,1,70,4],[69,1,69,4],[71,1,71,4],[72,1,72,4]]}
["Jon Niermann, Chairman"]
["Emily Lindley, Commissioner"]
["Bobby Janecka, Commissioner"]
["Toby Baker, Executive Director"]
[]
[null,"Texas Commission on Environmental Quality"]
[null,"Protecting Texas by Reducing and Preventing Pollution"]
[]
[null,{"$f":"TODAY()","v":"2022-10-04"}]
[]
[null,{"$f":"Cover_Sheet!I10&\". \"&Cover_Sheet!C9&\" \"&Cover_Sheet!G9","v":". Ben Davis"}]
[null,{"$f":"Cover_Sheet!C10","v":"Owner"}]
[null,{"$f":"Cover_Sheet!C8","v":"NIDO, Ltd."}]
[null,{"$f":"Cover_Sheet!C11","v":"550 Farm-To-Market Road 78"}]
[null,{"$f":"Cover_Sheet!C12&\", \"&Cover_Sheet!F12&\" \"&Cover_Sheet!I12","v":"Schertz, TX 78154"}]
[]
[null,"Subject:",null,{"$f":"Cover_Sheet!C26&\" - \"&Cover_Sheet!C30&\" County\"","v":"Beck Landfill - Guadalupe County"}]
[null,null,null,{"$f":"\"Municipal Solid Waste (MSW) - \"&Cover_Sheet!G29&\" No. \"&Cover_Sheet!H28","v":"Municipal Solid Waste (MSW) - Permit No. 1848"}]
[null,null,null,{"$f":"Cover_Sheet!G30&\" Application - \"&IF(Procedures!C28=\"Admin\",\"Administrative \",\"\")&\"Notice of Deficiency\"","v":"Permit Amendment Application - Notice of Deficiency"}]
[null,null,null,{"$f":"\"Tracking No. \" &Procedures!G27&\"; RN\"&Cover_Sheet!C29&\"/CN\"&Cover_Sheet!C28","v":"Tracking No. ; RNRN102310968/CNCN603075011"}]
[]
[null,{"$f":"\"Dear \"&Cover_Sheet!I10&\". \"&Cover_Sheet!G9&\":\"","v":"Dear . Davis:"}]
[]
[null,{"$f":"\"We have completed the \"&IF(Procedures!C28=\"Admin\",\"administrative \",\"\")&\"review of the \"&IF(OR(Procedures!C28=2,)=TRUE,\"NOD response\",\"application\")&\" dated \"&IF(OR(Procedures!C28=1, Procedures!C28=\"Admin\"),TEXT(DATE(SourceData!K35,SourceData!I35,SourceData!J35),\"mmmm\")&\" \"&SourceData!J35&\", \"&SourceData!K35,TEXT(DATE(SourceData!K37,SourceData!I37,SourceData!J37),\"mmmm\")&\" \"&SourceData!J37&\", \"&SourceData!K37)&\", for the above-referenced facility. Additional information must be presented to demonstrate\"&\" compliance with Title 30 Texas Administrative Code (30 TAC) Chapter 305 and Chapter 330. Please respond to the items listed in the enclosed table, in the following format:\"","v":"We have completed the review of the application dated January 0, 1900, for the above-referenced facility. Additional information must be presented to demonstrate compliance with Title 30 Texas Administrative Code (30 TAC) Chapter 305 and Chapter 330. Please respond to the items listed in the enclosed table, in the following format:"}]
[]
[]
[]
[]
[null,"Provide a dated cover letter with the revised application;"]
[null,"Provide responses to NOD Items in table format using the enclosed table;"]
{"$rows_left_out":49}
{"sheet":"NODAdmin Table","index":6,"n_rows":1,"n_cols":9,"rows_kept":1,"cut":false,"hidden":true,"merged":[]}
["NOD\nID","ID","MRI ID","App. Part","Citation","Location","T/NT","Admin NOD Type","NOD Description"]

{"sheet":"NOD1 Table","index":7,"n_rows":4,"n_cols":9,"rows_kept":4,"cut":false,"hidden":true,"merged":[]}
["NOD\nID","ID","MRI ID","App. Part","Citation","Location","T/NT","1st NOD Type","NOD Description"]
[]
[]
[null,3]

{"sheet":"NOD2 Table","index":8,"n_rows":3,"n_cols":9,"rows_kept":3,"cut":false,"hidden":true,"merged":[]}
["NOD\nID","ID","MRI ID","App. Part","Citation","Location","T/NT","2nd NOD Type","NOD Description"]
[{"$f":"CONCATENATE(G2,B2)","v":""}]
[{"$f":"CONCATENATE(G3,B3)","v":""}]

{"sheet":"SourceData","index":9,"n_rows":41,"n_cols":13,"rows_kept":41,"cut":false,"hidden":true,"merged":[]}
["Ambiguous",null,"Permit",null,null,null,null,"Admin",null,null,"Region","Address"]
["Incomplete",null,"Registration",null,null,null,null,1,null,null,"R-1 Amarillo","Eddy.Vance@tceq.texas.gov, Region 1","Amarillo"]
["Inconsistent",null,null,null,null,null,null,2,null,null,"R-2 Lubbock","Jay.Keith@tceq.texas.gov, Region 2","Lubbock"]
["Incorrect",null,null,null,null,null,null,null,null,null,"R-3 Abilene","AbileneWaste@tceq.texas.gov, Region 3","Abilene"]
["Omitted",null,null,null,null,null,null,null,null,null,"R-4 Dallas/FW"," DFWwaste@tceq.texas.gov, Region 4","Dallas/Fort Worth"]
["Format",null,"New Permit",null,null,"Yes",null,null,null,null,"R-5 Tyler","TylerWaste@tceq.texas.gov, Region 5","Tyler"]
["Comment Only",null,"New Registration",null,null,"No",null,"T",null,null,"R-6 El Paso"," Kent.Waggoner@tceq.texas.gov, Region 6","El Paso"]
["N/A",null,"Permit Amendment",null,null,"N/A",null,"NT",null,null,"R-7 Midland","PUBCOMMENT-R07MID@tceq.texas.gov, Region 7","Midland"]
[null,null,null,null,null,null,null,null,null,null,"R-8 San Angelo","Christopher.Mayben@tceq.texas.gov, Region 8","San Angelo"]
[null,null,null,null,null,"Mr",null,null,null,null,"R-9 Waco"," PUBCOMMENT-R09WAC@tceq.texas.gov, Region 9","Waco"]
[null,null,null,null,null,"Ms",null,null,null,null,"R-10 Beaumont","Charlie.Adams@tceq.texas.gov","Beaumont"]
[null,null,null,null,null,null,null,null,null,null,"R-11 Austin","PUBCOMMENT-R11AUS@tceq.texas.gov, Region 11","Austin"]
[null,null,null,null,null,null,null,null,null,null,"R-12 Houston","HoustonWaste@tceq.texas.gov, Region 12","Houston"]
[null,null,null,null,null,null,null,null,null,null,"R-13 San Antonio"," Cameron.Lopez@tceq.texas.gov, Region 13","San Antonio"]
[null,null,null,null,null,null,null,null,null,null,"R-14 Corpus Christi","Timothy.Perdue@tceq.texas.gov, Region 14","Corpus Christi"]
[null,null,null,null,null,null,null,null,null,null,"R-15 Harlingen","Francisco.Chavero@tceq.texas.gov, Region 15","Harlingen"]
[null,null,null,null,null,null,null,null,null,null,"R-16 Laredo","Arnaldo.Lanese@tceq.texas.gov, Region 16","Laredo"]
[]
[]
[]
[]
[]
[]
[]
[null,null,null,null,"Type IV Landfill",{"$f":"VLOOKUP(E25,E26:F41,2,FALSE)","v":18}]
[null,null,null,null,"Type I Landfill",17]
[null,null,null,null,"Type IV Landfill",18]
[null,null,null,null,"Type IAE Landfill",19]
[null,null,null,null,"Type IVAE Landfill",20]
[null,null,null,null,"Type IAE & IVAE Landfill",33]
{"$rows_left_out":11}